React Native Run Android Fail Appincrementaldebugjavacompilationsafeguard Failed Information Guide

  1. Overview on React Native Run Android Fail Appincrementaldebugjavacompilationsafeguard Failed
  2. Important Facts
  3. History
  4. Full Guide
  5. Summary

Overview on React Native Run Android Fail Appincrementaldebugjavacompilationsafeguard Failed

React-Native run-android FAIL! appincrementalDebugJavaCompilationSafeguard FAILED Guide
Looking for the latest information on React Native Run Android Fail Appincrementaldebugjavacompilationsafeguard Failed? We've researched comprehensive data, records, and insights about React Native Run Android Fail Appincrementaldebugjavacompilationsafeguard Failed.

Important Facts

Details How to Fix the Failed to Install App Error in React Native on Android Guide
Explore the main sources for React Native Run Android Fail Appincrementaldebugjavacompilationsafeguard Failed.

History

Full error message : Task :app:installDebug FAILED | React Native Errors | Fixed! News
Stay updated on React Native Run Android Fail Appincrementaldebugjavacompilationsafeguard Failed's newest achievements.

STOP Wasting Time on Gradle Errors in React Native! | 100% Resolved Gradle issue in React Native
STOP Wasting Time on Gradle Errors in React Native! | 100% Resolved Gradle issue in React Native
React Native Failed to install the App error, Android emulator not starting or lost connection
React Native Failed to install the App error, Android emulator not starting or lost connection
Use Android Mobile as Emulator in React Native CLI | Run React Native App on Real Android Device
Use Android Mobile as Emulator in React Native CLI | Run React Native App on Real Android Device
React Native Errors - Failed to install and Unable to load script, Solved!!!
React Native Errors - Failed to install and Unable to load script, Solved!!!
Fix Gradle Errors in React Native | Step-by-Step Guide
Fix Gradle Errors in React Native | Step-by-Step Guide
Error Command failed gradlew bat app installDebug  PreactNativeDevServerPort=8081 React Native fixed
Error Command failed gradlew bat app installDebug PreactNativeDevServerPort=8081 React Native fixed
Error Node JS Server Opens and Closes Quickly After React-Native Run-Android Command
Error Node JS Server Opens and Closes Quickly After React-Native Run-Android Command
Solved: React Native Build Failed | Reanimated & Gradle Lock Issue Fixed!
Solved: React Native Build Failed | Reanimated & Gradle Lock Issue Fixed!
Error Failed to run jetifier react native android studio solved
Error Failed to run jetifier react native android studio solved
React Native Errors #1 | Error: spawn ./gradlew EACCES SOLVED!!!
React Native Errors #1 | Error: spawn ./gradlew EACCES SOLVED!!!
error message : Task :app:installDebug FAILED | React Native | Fixed | Hindi
error message : Task :app:installDebug FAILED | React Native | Fixed | Hindi

Full Guide

Data is compiled from public records and verified media reports.

Last Updated: October 26, 2026

Summary

Full [Fixed] Gradle build failed with unknown error in Expo/React Native Update
For 2026, React Native Run Android Fail Appincrementaldebugjavacompilationsafeguard Failed remains one of the most searched-for information profiles. Check back for the latest updates.

Disclaimer: Disclaimer: All information is compiled from publicly available data, media reports, and analysis. Actual details may vary.

Summary

long story short : open command prompt in the Tired of wasting time on Gradle errors in Provide an excellent and consistent remedy for "task -app-installDebug" In this step-by-step tutorial, you'll learn how to use your In this video the most commonly faced while making a # Facing Gradle issues while working with Hello Friends In this tutorial video, I will explain you how to fix Node JS In this video, I fixed two common

React Native Run Android Fail Appincrementaldebugjavacompilationsafeguard Failed.pdf

Size: 2.27 MB · Format: PDF · Secure Download

Download PDF Read Online

Frequently Asked Questions

What is the most accurate information about React Native Run Android Fail Appincrementaldebugjavacompilationsafeguard Failed?

Our platform aggregates the most comprehensive and up-to-date insights, ensuring you get relevant details about React Native Run Android Fail Appincrementaldebugjavacompilationsafeguard Failed.

Why is React Native Run Android Fail Appincrementaldebugjavacompilationsafeguard Failed trending right now?

Interest in React Native Run Android Fail Appincrementaldebugjavacompilationsafeguard Failed has surged recently as more people seek reliable resources, related media, and detailed analysis.

Where can I find related media and updates for React Native Run Android Fail Appincrementaldebugjavacompilationsafeguard Failed?

You can explore extensive galleries, video summaries, and related content directly on this page.

How often is the content about React Native Run Android Fail Appincrementaldebugjavacompilationsafeguard Failed updated?

We regularly update our database with the latest information, media, and analysis related to React Native Run Android Fail Appincrementaldebugjavacompilationsafeguard Failed.

Related Documents

Popular Topics

The Truth About Mass Migration 5g Sim Projects 5g Sim Thesis 5g Sim Projects Code 5g Sim Projects Tutorials 4k 260427 %ed%88%ac%ec%96%b4%ec%8a%a4 %ec%87%bc%ec%bc%80%ec%9d%b4%ec%8a%a4 Back To Strangers %ec%98%81%ec%9e%ac %ec%a7%81%ec%ba%a0 Opening The Chinese Pokemon 30th Celebration Booster Box Amazing Pulls Unlimited Free Vibe Coding In Vs Code Using Opencode Brewstew Trampoline Sam Leavitt How To Use Duckduckgo How To Remove Liked Posts On Linkedin 2026 Guide Future Mask Off Ft Terry Crews 2014 Anchorage Summer Solstice Celebration Commercial Full Episode Today Show Oct 23 I Built An Iphone App With Meta S Muse Code David Kushner Daylight Lyrics Does Your Vote Still Matter
close