Fix App Store Upload Error Hermes Framework Contains Bitcode React Native Ios Build Failed Information Guide

  1. Background to Fix App Store Upload Error Hermes Framework Contains Bitcode React Native Ios Build Failed
  2. Key Details
  3. History
  4. Expert Insights
  5. Future Outlook

Background to Fix App Store Upload Error Hermes Framework Contains Bitcode React Native Ios Build Failed

Information Fix App Store Upload Error | Hermes.framework Contains Bitcode | React Native iOS Build Failed Guide
Looking for the latest information on Fix App Store Upload Error Hermes Framework Contains Bitcode React Native Ios Build Failed? We've researched comprehensive data, records, and insights about Fix App Store Upload Error Hermes Framework Contains Bitcode React Native Ios Build Failed.

Key Details

Fixing iOS Production Build Crashes in React Native Apps with Expo News
Explore the key sources for Fix App Store Upload Error Hermes Framework Contains Bitcode React Native Ios Build Failed.

History

Information Fix Xcode Missing Assets Error | Create iOS App Icons & Upload to App Store Update
Stay updated on Fix App Store Upload Error Hermes Framework Contains Bitcode React Native Ios Build Failed's latest milestones.

Invalid Executable. The executable 'appname.app/Frameworks/hermes.framework/hermes' contains bitcode
Invalid Executable. The executable 'appname.app/Frameworks/hermes.framework/hermes' contains bitcode
Fix Bitcode Errors in Xcode 16 | How to Solve Invalid Executable When Uploading iOS Builds
Fix Bitcode Errors in Xcode 16 | How to Solve Invalid Executable When Uploading iOS Builds
error Failed to build iOS project We ran xcodebuild command but it exited with error code 65
error Failed to build iOS project We ran xcodebuild command but it exited with error code 65
Resolved: Failed to build iOS app error ** BUILD FAILED ** Could not build the app for the simulator
Resolved: Failed to build iOS app error ** BUILD FAILED ** Could not build the app for the simulator
How to Fix the Build Input File Cannot Be Found Error in React Native with Xcode
How to Fix the Build Input File Cannot Be Found Error in React Native with Xcode
[Fixed] xcodebuild: error: Could not resolve package dependencies | React Native | Xcode | iOS
[Fixed] xcodebuild: error: Could not resolve package dependencies | React Native | Xcode | iOS
'No bundle URL present'  error in react native ios build
'No bundle URL present' error in react native ios build
error failed to build ios project. we ran xcodebuild command but it exited with error code 65.
error failed to build ios project. we ran xcodebuild command but it exited with error code 65.
Xcode 14.3 Simulator 16.4 Build Failure ‘Value is Unavailable: introduced in iOS 12.0’  React Native
Xcode 14.3 Simulator 16.4 Build Failure ‘Value is Unavailable: introduced in iOS 12.0’ React Native
Xcode app installation failed missing bundle | 27 NSPOSIXErrorDomain Code 22| Invalid argument error
Xcode app installation failed missing bundle | 27 NSPOSIXErrorDomain Code 22| Invalid argument error
Upgrading Xcode to 15.3 results in build error. React native
Upgrading Xcode to 15.3 results in build error. React native

Expert Insights

Data is compiled from public records and verified media reports.

Last Updated: October 26, 2026

Future Outlook

Information xcodeproj vs xcworkspace in React Native iOS | Fix No such module Error Update
For 2026, Fix App Store Upload Error Hermes Framework Contains Bitcode React Native Ios Build Failed remains one of the most searched-for information profiles. Check back for the newest reports.

Disclaimer: Disclaimer: All information is compiled from publicly available data, media reports, and analysis. Actual details may vary.

Summary

code start ---- bitcode_strip_path = `xcrun --find bitcode_strip`.chop! def strip_bitcode_from_framework(bitcode_strip_path, ... Discover how to resolve the issue of ` Invalid Executable. The executable 'appname. YouTube Description Struggling with Hello everyone, it's my first video speaking english, I hope you understand, and resolve the

Fix App Store Upload Error Hermes Framework Contains Bitcode React Native Ios Build Failed.pdf

Size: 4.28 MB · Format: PDF · Secure Download

Download PDF Read Online

Frequently Asked Questions

What is the most accurate information about Fix App Store Upload Error Hermes Framework Contains Bitcode React Native Ios Build Failed?

Our platform aggregates the most comprehensive and up-to-date insights, ensuring you get relevant details about Fix App Store Upload Error Hermes Framework Contains Bitcode React Native Ios Build Failed.

Why is Fix App Store Upload Error Hermes Framework Contains Bitcode React Native Ios Build Failed trending right now?

Interest in Fix App Store Upload Error Hermes Framework Contains Bitcode React Native Ios Build Failed has surged recently as more people seek reliable resources, related media, and detailed analysis.

Where can I find related media and updates for Fix App Store Upload Error Hermes Framework Contains Bitcode React Native Ios Build Failed?

You can explore extensive galleries, video summaries, and related content directly on this page.

How often is the content about Fix App Store Upload Error Hermes Framework Contains Bitcode React Native Ios Build Failed updated?

We regularly update our database with the latest information, media, and analysis related to Fix App Store Upload Error Hermes Framework Contains Bitcode React Native Ios Build Failed.

Related Documents

Popular Topics

The Sheriff Peyton Manning Tribute 7 Years Stop Grounding Yourself %e2%80%94 Your Soul Wants To Fly %e2%9c%85 Abraham Hicks 2026 Alone Alan Walker Lyrics Soulyrics7 Tf2 Pyro Shark Solved Here Is How To Read Paywall Articles For Free A Plataforma De Eventos Completa Para Vender Ingressos Antecipados Use Ingresso Heavy Rain And Thunder Sound For Deep Sleep Within 3 Minutes Black Screen Sound In 24h Columbia College Your Success Is Our Mission Gntm 2023 Heidi Klum Tanzt In Die 18 Staffel Gntm 2023 Prosieben How To Install Java 8 On Windows 2025 Set Java Home Jdk 8 Windows 11 Windows 10 Xts5 5 Wall Mounted Touchscreen Basic Overview Legacy Product Deanthony Integrating Jetformbuilder With Custom Api Step By Step Tutorial Bit Integrations Master Linux File Permissions Ownership Chmod Chown Chgrp Explained Simply Learn Go Programming Introduction Installation Your First Go Program Golang Kodekloud
close